PhoneGap中文网

 找回密码
 立即注册

QQ登录

只需一步,快速开始

查看: 2087|回复: 1

ionic build android突然出现奇怪的问题.

[复制链接]

1

主题

1

帖子

7

积分

新手上路

Rank: 1

积分
7
发表于 2019-1-21 16:48:12 | 显示全部楼层 |阅读模式
有哪个大佬遇到这样的问题吗?之前能打包成功。今天突然不行了
cordova-android-support-gradle-release: Android platform: V6
        cordova-android-support-gradle-release: No custom version found in config.xml - using plugin default
        Running command: "D:\Program Files\nodejs\node.exe"
        D:\projectGillion\androidAppBrach\2019fixversion\20190124\hooks\after_prepare\010_add_platform_class.js
        D:\projectGillion\androidAppBrach\2019fixversion\20190124
        add to body class: platform-android
        cordova-android-support-gradle-release: Android platform: V6
        cordova-android-support-gradle-release: No custom version found in config.xml - using plugin default
        ANDROID_HOME=D:\projectGillion\android-sdk-windows
        JAVA_HOME=D:\Program Files\Java\jdk1.8.0_45
        Subproject Path: CordovaLib
        +-----------------------------------------------------------------
        | cordova-android-support-gradle-release: 27.+
        +-----------------------------------------------------------------
        Incremental java compilation is an incubating feature.

        FAILURE: Build failed with an exception.

        * What went wrong:
        A problem occurred configuring root project 'android'.
        > Could not resolve all dependencies for configuration ':_debugApkCopy'.
            > Could not resolve com.github.nanchen2251:CompressHelper:1.0.+.
              Required by:
                  :android:unspecified
               > Could not resolve com.github.nanchen2251:CompressHelper:1.0.+.
                  > Failed to list versions for com.github.nanchen2251:CompressHelper.
                     > Unable to load Maven meta-data from
        https://jitpack.io/com/github/na ... maven-metadata.xml.
                        > Could not GET 'https://jitpack.io/com/github/nanchen2251/CompressHelper/maven-metadata.xml'.
                           > sun.security.validator.ValidatorException: PKIX path building failed:
        sun.security.provider.certpath.SunCertPathBuilderException: unable to find valid certification path to requested
        target
回复

使用道具 举报

您需要登录后才可以回帖 登录 | 立即注册

本版积分规则

关闭

站长推荐上一条 /1 下一条

ionic4视频教程

Archiver|手机版|小黑屋|PhoneGap中文网 ( 京ICP备13027796号-1

GMT+8, 2019-4-24 18:46 , Processed in 0.250277 second(s), 33 queries .

Powered by Discuz! X3.2

© 2001-2013 Comsenz Inc.

快速回复 返回顶部 返回列表