PhoneGap中文网

 找回密码
 立即注册

QQ登录

只需一步,快速开始

查看: 9405|回复: 11

phonegap案例:NodeJs中文社区app下载

[复制链接]

485

主题

2012

帖子

6504

积分

管理员

Rank: 9Rank: 9Rank: 9

积分
6504
发表于 2015-3-2 20:36:50 | 显示全部楼层 |阅读模式
CNode是中国最大的Node.js专业中文社区, CNodeJs中文社区APP采用 phonegap+angularjs+ionic开发 ios运行流畅,如果我不告诉你他是用 html5 开发的你简直是难以置信。 当然在android环境下面表现的就没有ios那么流畅,可能是我手机配置的问题



更新日志
- 更名为:CNode社区
- 增加推送通知
- 适配了iPhone 6、iPhone 6 Plus和iPad
- 些许小改进


1.2.1之后为内测版
之前版本为企业版





ios android下载地址:


1.png


在android环境下面表现的就没有ios那么流畅,ios下面和原生看不出来差别

CNode社区源码下载地址:
ionic-cnodejs-master.zip (1.47 MB, 下载次数: 9869)
回复

使用道具 举报

0

主题

3

帖子

8

积分

新手上路

Rank: 1

积分
8
发表于 2015-3-11 21:48:59 | 显示全部楼层
谢谢,回复先
回复 支持 反对

使用道具 举报

1

主题

6

帖子

37

积分

新手上路

Rank: 1

积分
37
发表于 2015-7-27 18:39:52 | 显示全部楼层

F:\gitsource\ionic-cnodejs-master>npm install
npm WARN package.json cnodejs@1.0.0 No repository field.
npm WARN package.json cnodejs@1.0.0 No license field.
-
> node-sass@0.9.6 install F:\gitsource\ionic-cnodejs-master\node_modules\gulp-sass\node_modules\node-sass
> node build.js

child_process: customFds option is deprecated, use stdio instead.

F:\gitsource\ionic-cnodejs-master\node_modules\gulp-sass\node_modules\node-sass>if not defined npm_config_node_gyp
ode-gyp.js" rebuild )  else (node  rebuild )
gyp: C:\Documents and Settings\Administrator\.node-gyp\0.12.7\common.gypi not found (cwd: F:\gitsource\ionic-cnode
ding.gyp while trying to load binding.gyp
gyp ERR! configure error
gyp ERR! stack Error: `gyp` failed with exit code: 1
gyp ERR! stack     at ChildProcess.onCpExit (F:\nodejs\node_modules\npm\node_modules\node-gyp\lib\configure.js:355
gyp ERR! stack     at ChildProcess.emit (events.js:110:17)
gyp ERR! stack     at Process.ChildProcess._handle.onexit (child_process.js:1074:12)
gyp ERR! System Windows_NT 5.1.2600
gyp ERR! command "node" "F:\\nodejs\\node_modules\\npm\\node_modules\\node-gyp\\bin\\node-gyp.js" "rebuild"
gyp ERR! cwd F:\gitsource\ionic-cnodejs-master\node_modules\gulp-sass\node_modules\node-sass
gyp ERR! node -v v0.12.7
gyp ERR! node-gyp -v v2.0.1
gyp ERR! not ok
Build failed
npm ERR! Windows_NT 5.1.2600
npm ERR! argv "F:\\nodejs\\\\node.exe" "F:\\nodejs\\node_modules\\npm\\bin\\npm-cli.js" "install"
npm ERR! node v0.12.7
npm ERR! npm  v2.11.3
npm ERR! code ELIFECYCLE

npm ERR! node-sass@0.9.6 install: `node build.js`
npm ERR! Exit status 1
npm ERR!
npm ERR! Failed at the node-sass@0.9.6 install script 'node build.js'.
npm ERR! This is most likely a problem with the node-sass package,
npm ERR! not with npm itself.
npm ERR! Tell the author that this fails on your system:
npm ERR!     node build.js
npm ERR! You can get their info via:
npm ERR!     npm owner ls node-sass
npm ERR! There is likely additional logging output above.

npm ERR! Please include the following file with any support request:
npm ERR!     F:\gitsource\ionic-cnodejs-master\npm-debug.log

F:\gitsource\ionic-cnodejs-master>














回复 支持 反对

使用道具 举报

0

主题

3

帖子

14

积分

新手上路

Rank: 1

积分
14
发表于 2015-7-30 21:18:26 | 显示全部楼层
界面上确实看不出区别
回复 支持 反对

使用道具 举报

4

主题

16

帖子

67

积分

注册会员

Rank: 2

积分
67
发表于 2015-9-7 17:29:39 | 显示全部楼层
为何拷出源代码  在手机端无法显示 空白  pc端显示正常 服务端是否有特殊的设置哦
回复 支持 反对

使用道具 举报

您需要登录后才可以回帖 登录 | 立即注册

本版积分规则

关闭

站长推荐上一条 /1 下一条

Archiver|手机版|小黑屋|PhoneGap中文网 ( 京ICP备13027796号-1

GMT+8, 2017-11-22 05:12 , Processed in 0.228820 second(s), 43 queries .

Powered by Discuz! X3.2

© 2001-2013 Comsenz Inc.

快速回复 返回顶部 返回列表